Reaction Details
TargetReceptor tyrosine-protein kinase erbB-2
LigandBDBM50301124
Substrate/Competitorn/a
Meas. Tech.ChEMBL_598553 (CHEMBL1043545)
IC50 162±n/a nM
Citation Li, YLShi, EBurns, DLi, YCovington, MBPan, MScherle, PFriedman, SMetcalf, BYao, W Discovery of novel selective HER-2 sheddase inhibitors through optimization of P1 moiety. Bioorg Med Chem Lett19:5037-42 (2009) 
 
Receptor tyrosine-protein kinase erbB-2
Name:Receptor tyrosine-protein kinase erbB-2
Type:n/a
Mol. Mass.:137894.47
Organism:Homo sapiens (Human)
Description:P04626
Residue:1255
BDBM50301124
NameBDBM50301124
Synonyms:(2S,3S)-5-(2-(4-aminobutylamino)-2-oxoethyl)-N-hydroxy-2-(3-phenylpyrrolidine-1-carbonyl)piperidine-3-carboxamide | CHEMBL568356
TypeSmall organic molecule
Emp. Form.C23H35N5O4
Mol. Mass.445.5551
SMILESNCCCCNC(=O)CC1CN[C@@H]([C@H](C1)C(=O)NO)C(=O)N1CCC(C1)c1ccccc1