Reaction Details
TargetDisintegrin and metalloproteinase domain-containing protein 10
LigandBDBM50301122
Substrate/Competitorn/a
Meas. Tech.ChEMBL_598554 (CHEMBL1043546)
IC50 138±n/a nM
Citation Li, YLShi, EBurns, DLi, YCovington, MBPan, MScherle, PFriedman, SMetcalf, BYao, W Discovery of novel selective HER-2 sheddase inhibitors through optimization of P1 moiety. Bioorg Med Chem Lett19:5037-42 (2009) 
 
Disintegrin and metalloproteinase domain-containing protein 10
Name:Disintegrin and metalloproteinase domain-containing protein 10
Type:Enzyme
Mol. Mass.:84160.93
Organism:Homo sapiens (Human)
Description:O14672
Residue:748
BDBM50301122
NameBDBM50301122
Synonyms:(2S,3S)-N-hydroxy-5-(N-methylisobutyramido)-2-((R)-3-phenylpyrrolidine-1-carbonyl)piperidine-3-carboxamide | CHEMBL567939
TypeSmall organic molecule
Emp. Form.C22H32N4O4
Mol. Mass.416.5139
SMILESCC(C)C(=O)N(C)C1CN[C@@H]([C@H](C1)C(=O)NO)C(=O)N1CC[C@@H](C1)c1ccccc1