Reaction Details
TargetDisintegrin and metalloproteinase domain-containing protein 10
LigandBDBM50301123
Substrate/Competitorn/a
Meas. Tech.ChEMBL_598554 (CHEMBL1043546)
IC50 84±n/a nM
Citation Li, YLShi, EBurns, DLi, YCovington, MBPan, MScherle, PFriedman, SMetcalf, BYao, W Discovery of novel selective HER-2 sheddase inhibitors through optimization of P1 moiety. Bioorg Med Chem Lett19:5037-42 (2009) 
 
Disintegrin and metalloproteinase domain-containing protein 10
Name:Disintegrin and metalloproteinase domain-containing protein 10
Type:Enzyme
Mol. Mass.:84160.93
Organism:Homo sapiens (Human)
Description:O14672
Residue:748
BDBM50301123
NameBDBM50301123
Synonyms:(2S,3S)-N-hydroxy-5-(N-methylbenzamido)-2-((R)-3-phenylpyrrolidine-1-carbonyl)piperidine-3-carboxamide | CHEMBL584960
TypeSmall organic molecule
Emp. Form.C25H30N4O4
Mol. Mass.450.5301
SMILESCN(C1CN[C@@H]([C@H](C1)C(=O)NO)C(=O)N1CC[C@@H](C1)c1ccccc1)C(=O)c1ccccc1