Reaction Details
TargetMelanin-concentrating hormone receptor 1
LigandBDBM50301700
Substrate/Competitorn/a
Meas. Tech.ChEMBL_597858 (CHEMBL1039121)
IC50 2.6±n/a nM
Citation Suzuki, TKameda, MAndo, MMiyazoe, HSekino, EIto, SMasutani, KKamijo, KTakezawa, AMoriya, MIto, MIto, JNakase, KMatsushita, HIshihara, ATakenaga, NTokita, SKanatani, ASato, NFukami, T Discovery of novel diarylketoxime derivatives as selective and orally active melanin-concentrating hormone 1 receptor antagonists. Bioorg Med Chem Lett19:5339-45 (2009) 
 
Melanin-concentrating hormone receptor 1
Name:Melanin-concentrating hormone receptor 1
Type:G Protein-Coupled Receptor (GPCR)
Mol. Mass.:45976.27
Organism:Homo sapiens (Human)
Description:Membranes from CHO-K1 cells stably expressing human MCH1R were used in assays.
Residue:422
BDBM50301700
NameBDBM50301700
Synonyms:CHEMBL568361 | rac-1-(3,4-difluorophenyl)-1-(4-((6-fluoro-1H-spiro[furo[3,4-c]pyridine-3,4'-piperidine]-1'-yl)methyl)phenyl)ethanol
TypeSmall organic molecule
Emp. Form.C26H25F3N2O2
Mol. Mass.454.4841
SMILESCC(O)(c1ccc(CN2CCC3(CC2)OCc2cc(F)ncc32)cc1)c1ccc(F)c(F)c1