Reaction Details
TargetMelanin-concentrating hormone receptor 1
LigandBDBM50301707
Substrate/Competitorn/a
Meas. Tech.ChEMBL_597858 (CHEMBL1039121)
IC50 45±n/a nM
Citation Suzuki, TKameda, MAndo, MMiyazoe, HSekino, EIto, SMasutani, KKamijo, KTakezawa, AMoriya, MIto, MIto, JNakase, KMatsushita, HIshihara, ATakenaga, NTokita, SKanatani, ASato, NFukami, T Discovery of novel diarylketoxime derivatives as selective and orally active melanin-concentrating hormone 1 receptor antagonists. Bioorg Med Chem Lett19:5339-45 (2009) 
 
Melanin-concentrating hormone receptor 1
Name:Melanin-concentrating hormone receptor 1
Type:G Protein-Coupled Receptor (GPCR)
Mol. Mass.:45976.27
Organism:Homo sapiens (Human)
Description:Membranes from CHO-K1 cells stably expressing human MCH1R were used in assays.
Residue:422
BDBM50301707
NameBDBM50301707
Synonyms:(Z)-1'-((6-((3,4-difluorophenyl)(ethoxyimino)methyl)pyridin-3-yl)methyl)-5-methyl-1H-spiro[furo[3,4-c]pyridine-3,4'-piperidin]-6(5H)-one | CHEMBL585880
TypeSmall organic molecule
Emp. Form.C27H28F2N4O3
Mol. Mass.494.533
SMILESCCO\N=C(\c1ccc(F)c(F)c1)c1ccc(CN2CCC3(CC2)OCc2cc(=O)n(C)cc32)cn1