Reaction Details
TargetPotassium voltage-gated channel subfamily H member 2
LigandBDBM50301698
Substrate/Competitorn/a
Meas. Tech.ChEMBL_597859 (CHEMBL1039122)
IC50 25±n/a nM
Citation Suzuki, TKameda, MAndo, MMiyazoe, HSekino, EIto, SMasutani, KKamijo, KTakezawa, AMoriya, MIto, MIto, JNakase, KMatsushita, HIshihara, ATakenaga, NTokita, SKanatani, ASato, NFukami, T Discovery of novel diarylketoxime derivatives as selective and orally active melanin-concentrating hormone 1 receptor antagonists. Bioorg Med Chem Lett19:5339-45 (2009) 
 
Potassium voltage-gated channel subfamily H member 2
Name:Potassium voltage-gated channel subfamily H member 2
Type:Multi-pass membrane protein
Mol. Mass.:126672.65
Organism:Homo sapiens (Human)
Description:Q12809
Residue:1159
BDBM50301698
NameBDBM50301698
Synonyms:3,4-difluoro-N-(4-((6-fluoro-1H-spiro[furo[3,4-c]pyridine-3,4'-piperidine]-1'-yl)methyl)phenyl)-N-methylaniline | CHEMBL585856
TypeSmall organic molecule
Emp. Form.C25H24F3N3O
Mol. Mass.439.4728
SMILESCN(c1ccc(CN2CCC3(CC2)OCc2cc(F)ncc32)cc1)c1ccc(F)c(F)c1