Reaction Details
TargetPotassium voltage-gated channel subfamily H member 2
LigandBDBM50301700
Substrate/Competitorn/a
Meas. Tech.ChEMBL_597859 (CHEMBL1039122)
IC50 530±n/a nM
Citation Suzuki, TKameda, MAndo, MMiyazoe, HSekino, EIto, SMasutani, KKamijo, KTakezawa, AMoriya, MIto, MIto, JNakase, KMatsushita, HIshihara, ATakenaga, NTokita, SKanatani, ASato, NFukami, T Discovery of novel diarylketoxime derivatives as selective and orally active melanin-concentrating hormone 1 receptor antagonists. Bioorg Med Chem Lett19:5339-45 (2009) 
 
Potassium voltage-gated channel subfamily H member 2
Name:Potassium voltage-gated channel subfamily H member 2
Type:Multi-pass membrane protein
Mol. Mass.:126672.65
Organism:Homo sapiens (Human)
Description:Q12809
Residue:1159
BDBM50301700
NameBDBM50301700
Synonyms:CHEMBL568361 | rac-1-(3,4-difluorophenyl)-1-(4-((6-fluoro-1H-spiro[furo[3,4-c]pyridine-3,4'-piperidine]-1'-yl)methyl)phenyl)ethanol
TypeSmall organic molecule
Emp. Form.C26H25F3N2O2
Mol. Mass.454.4841
SMILESCC(O)(c1ccc(CN2CCC3(CC2)OCc2cc(F)ncc32)cc1)c1ccc(F)c(F)c1