Reaction Details
TargetSigma non-opioid intracellular receptor 1
LigandBDBM81982
Substrate/Competitorn/a
Meas. Tech.ChEMBL_599822 (CHEMBL1042781)
Ki 61±n/a nM
Citation Jasper, ASchepmann, DLehmkuhl, KVela, JMBuschmann, HHolenz, JWünsch, B Synthesis of sigma receptor ligands with unsymmetrical spiro connection of the piperidine moiety. Eur J Med Chem44:4306-14 (2009) 
 
Sigma non-opioid intracellular receptor 1
Name:Sigma non-opioid intracellular receptor 1
Type:Protein
Mol. Mass.:25307.17
Organism:Cavia porcellus (Guinea pig)
Description:Q60492
Residue:223
BDBM81982
NameBDBM81982
Synonyms:CAS_97-39-2 DTG Tol2Gdn | cid_7333
TypeSmall organic molecule
Emp. Form.C15H17N3
Mol. Mass.239.3156
SMILESCc1ccccc1NC(N)=Nc1ccccc1C