Reaction Details
TargetTranscription factor HES-1
LigandBDBM50378455
Substrate/Competitorn/a
Meas. Tech.ChEMBL_598858 (CHEMBL1044690)
IC50 16500±n/a nM
Citation Arai, MAMasada, AOhtsuka, TKageyama, RIshibashi, M The first Hes1 dimer inhibitors from natural products. Bioorg Med Chem Lett19:5778-81 (2009) 
 
Transcription factor HES-1
Name:Transcription factor HES-1
Type:PROTEIN
Mol. Mass.:29762.25
Organism:Mus musculus
Description:ChEMBL_598858
Residue:282
BDBM50378455
NameBDBM50378455
Synonyms:LYCOGARUBIN B
TypeSmall organic molecule
Emp. Form.C24H19N3O5
Mol. Mass.429.4248
SMILESCOC(=O)c1[nH]c(C(=O)OC)c(-c2c[nH]c3ccc(O)cc23)c1-c1c[nH]c2ccccc12