Reaction Details
TargetGABA-A receptor; alpha-5/beta-3/gamma-2
LigandBDBM50378524
Substrate/Competitorn/a
Meas. Tech.ChEMBL_599604 (CHEMBL1040216)
Ki 5.5±n/a nM
Citation Achermann, GBallard, TMBlasco, FBroutin, PEBüttelmann, BFischer, HGraf, MHernandez, MCHilty, PKnoflach, FKoblet, AKnust, HKurt, AMartin, JRMasciadri, RPorter, RHStadler, HThomas, AWTrube, GWichmann, J Discovery of the imidazo[1,5-a][1,2,4]-triazolo[1,5-d][1,4]benzodiazepine scaffold as a novel, potent and selective GABA(A) alpha5 inverse agonist series. Bioorg Med Chem Lett19:5746-52 (2009) 
 
GABA-A receptor; alpha-5/beta-3/gamma-2
Name:GABA-A receptor; alpha-5/beta-3/gamma-2
Type:n/a
Mol. Mass.:n/a
Description:ASSAY_ID of ChEMBL is 2148177
Components:This complex has 3 components.
Component 1
Name:Gamma-aminobutyric acid receptor subunit gamma-2
Synonyms:GABA(A) receptor subunit gamma-2 GBRG2_HUMAN
Type:PROTEIN
Mol. Mass.:54172.74
Organism:Homo sapiens (Human)
Description:EBI_217
Residue:467
Component 2
Name:Gamma-aminobutyric acid receptor subunit beta-3
Synonyms:GABA A receptor alpha-4/beta-3/gamma-2 GABA-A receptor GBRB3_HUMAN | agonist GABA site
Type:PROTEIN
Mol. Mass.:54130.51
Organism:Homo sapiens (Human)
Description:ChEMBL_448071
Residue:473
Component 3
Name:Gamma-aminobutyric acid receptor subunit alpha-5
Synonyms:GABA receptor alpha-5 subunit GABRA5 Gamma-aminobutyric acid receptor subunit alpha-5 (GABA(A)) | Gamma-aminobutyric acid receptor subunit alpha-5 (GABAA)
Type:Enzyme
Mol. Mass.:52160.59
Organism:Homo sapiens (Human)
Description:P31644
Residue:462
BDBM50378524
NameBDBM50378524
Synonyms:CHEMBL584546
TypeSmall organic molecule
Emp. Form.C20H20N4O2
Mol. Mass.348.3984
SMILESCCCc1ncc2Cc3c(ncn3-c3ccccc3-c2n1)C(=O)OCC