Reaction Details
TargetSerine racemase
LigandBDBM50378530
Substrate/Competitorn/a
Meas. Tech.ChEMBL_594810 (CHEMBL1042549)
IC50 170000±n/a nM
Citation Hoffman, HEJirásková, JCígler, PSanda, MSchraml, JKonvalinka, J Hydroxamic acids as a novel family of serine racemase inhibitors: mechanistic analysis reveals different modes of interaction with the pyridoxal-5'-phosphate cofactor. J Med Chem52:6032-41 (2009) 
 
Serine racemase
Name:Serine racemase
Type:PROTEIN
Mol. Mass.:36355.92
Organism:Mus musculus
Description:ChEMBL_1441161
Residue:339
BDBM50378530
NameBDBM50378530
Synonyms:CHEMBL566494
TypeSmall organic molecule
Emp. Form.C5H10N2O4
Mol. Mass.162.1439
SMILESONC(=O)CCCC(=O)NO