Reaction Details
TargetSerine racemase
LigandBDBM50378531
Substrate/Competitorn/a
Meas. Tech.ChEMBL_594810 (CHEMBL1042549)
IC50 90000±n/a nM
Citation Hoffman, HEJirásková, JCígler, PSanda, MSchraml, JKonvalinka, J Hydroxamic acids as a novel family of serine racemase inhibitors: mechanistic analysis reveals different modes of interaction with the pyridoxal-5'-phosphate cofactor. J Med Chem52:6032-41 (2009) 
 
Serine racemase
Name:Serine racemase
Type:PROTEIN
Mol. Mass.:36355.92
Organism:Mus musculus
Description:ChEMBL_1441161
Residue:339
BDBM50378531
NameBDBM50378531
Synonyms:CHEMBL566071
TypeSmall organic molecule
Emp. Form.C4H8N2O4
Mol. Mass.148.1173
SMILESONC(=O)CCC(=O)NO