Reaction Details
TargetSerine racemase
LigandBDBM50129194
Substrate/Competitorn/a
Meas. Tech.ChEMBL_594810 (CHEMBL1042549)
IC50 1300000±n/a nM
Citation Hoffman, HEJirásková, JCígler, PSanda, MSchraml, JKonvalinka, J Hydroxamic acids as a novel family of serine racemase inhibitors: mechanistic analysis reveals different modes of interaction with the pyridoxal-5'-phosphate cofactor. J Med Chem52:6032-41 (2009) 
 
Serine racemase
Name:Serine racemase
Type:PROTEIN
Mol. Mass.:36355.92
Organism:Mus musculus
Description:ChEMBL_1441161
Residue:339
BDBM50129194
NameBDBM50129194
Synonyms:(2S)-2-amino-4-(hydroxyamino)-4-oxobutanoic acidN(4)-hydroxy-L-asparagine L-Asparaginsaeure-4-hydroxyamid beta-L-Aspartylhydroxamate beta-aspartohydroxamic acid
TypeSmall organic molecule
Emp. Form.C4H8N2O4
Mol. Mass.148.1173
SMILESN[C@@H](CC(=O)NO)C(O)=O