Reaction Details
TargetIntegrin alpha-M/beta-2
LigandBDBM50378547
Substrate/Competitorn/a
Meas. Tech.ChEMBL_594634 (CHEMBL1037931)
EC50 18000±n/a nM
Citation Faridi, MHMaiguel, DBarth, CJStoub, DDay, RSchürer, SGupta, V Identification of novel agonists of the integrin CD11b/CD18. Bioorg Med Chem Lett19:6902-6 (2009) 
 
Integrin alpha-M/beta-2
Name:Integrin alpha-M/beta-2
Type:n/a
Mol. Mass.:n/a
Description:ASSAY_ID of EBI is 32647
Components:This complex has 2 components.
Component 1
Name:Integrin beta-2
Synonyms:CD18 ITGB2 MFI7
Type:PROTEIN
Mol. Mass.:84785.60
Organism:Homo sapiens (Human)
Description:EBI_12662
Residue:769
Component 2
Name:Integrin alpha-M
Synonyms:CD11B ITAM_HUMAN Integrin alpha-M/beta-2
Type:PROTEIN
Mol. Mass.:127185.59
Organism:Homo sapiens (Human)
Description:EBI_19658
Residue:1152
BDBM50378547
NameBDBM50378547
Synonyms:CHEMBL569007
TypeSmall organic molecule
Emp. Form.C22H18N2O4S2
Mol. Mass.438.519
SMILESCc1cccc(NC(=O)CN2C(=S)S\C(=C/c3ccc(Cc4ccco4)o3)C2=O)c1