Reaction Details
TargetSodium-dependent dopamine transporter
LigandBDBM50303312
Substrate/Competitorn/a
Meas. Tech.ChEMBL_595536 (CHEMBL1048771)
Ki 16±n/a nM
Citation Kaur, HIzenwasser, SVerma, AWade, DHousman, AStevens, EDMobley, DLTrudell, ML Synthesis and monoamine transporter affinity of 3alpha-arylmethoxy-3beta-arylnortropanes. Bioorg Med Chem Lett19:6865-8 (2009) 
 
Sodium-dependent dopamine transporter
Name:Sodium-dependent dopamine transporter
Type:Multi-pass membrane protein
Mol. Mass.:68749.45
Organism:Rattus norvegicus (rat)
Description:P23977
Residue:619
BDBM50303312
NameBDBM50303312
Synonyms:3-alpha-(4-Dichlorophenyl)methoxy-3-beta-phenyl-nortropane | CHEMBL585282
TypeSmall organic molecule
Emp. Form.C20H21Cl2NO
Mol. Mass.362.293
SMILESClc1ccc(COC2(CC3CCC(C2)N3)c2ccccc2)cc1Cl