Reaction Details
TargetTransporter
LigandBDBM50303311
Substrate/Competitorn/a
Meas. Tech.ChEMBL_595538 (CHEMBL1048773)
Ki 101±n/a nM
Citation Kaur, HIzenwasser, SVerma, AWade, DHousman, AStevens, EDMobley, DLTrudell, ML Synthesis and monoamine transporter affinity of 3alpha-arylmethoxy-3beta-arylnortropanes. Bioorg Med Chem Lett19:6865-8 (2009) 
 
Transporter
Name:Transporter
Type:Multi-pass membrane protein
Mol. Mass.:69236.90
Organism:Rattus norvegicus (rat)
Description:Q63380
Residue:617
BDBM50303311
NameBDBM50303311
Synonyms:3-alpha-(4-Chlorophenyl)methoxy-3-beta-phenyl-nortropane | CHEMBL578369
TypeSmall organic molecule
Emp. Form.C20H22ClNO
Mol. Mass.327.848
SMILESClc1ccc(COC2(CC3CCC(C2)N3)c2ccccc2)cc1