Reaction Details
TargetDihydropteroate synthase
LigandBDBM50378553
Substrate/Competitorn/a
Meas. Tech.ChEMBL_595738 (CHEMBL1045261)
IC50 19300±n/a nM
Citation Hevener, KEYun, MKQi, JKerr, IDBabaoglu, KHurdle, JGBalakrishna, KWhite, SWLee, RE Structural studies of pterin-based inhibitors of dihydropteroate synthase. J Med Chem53:166-77 (2010) 
 
Dihydropteroate synthase
Name:Dihydropteroate synthase
Synonyms:n/a
Type:PROTEIN
Mol. Mass.:30967.84
Organism:Bacillus anthracis
Description:ChEMBL_595739
Residue:280
BDBM50378553
NameBDBM50378553
Synonyms:CHEMBL161604
TypeSmall organic molecule
Emp. Form.C14H15N5O5
Mol. Mass.333.2994
SMILESNc1nc(NCCCOc2ccc(cc2)C(O)=O)c(N=O)c(=O)[nH]1