Reaction Details
TargetCarbonic anhydrase 12
LigandBDBM50131066
Substrate/Competitorn/a
Meas. Tech.ChEMBL_595958 (CHEMBL1044460)
Ki 2900±n/a nM
Citation Maresca, ATemperini, CPochet, LMasereel, BScozzafava, ASupuran, CT Deciphering the mechanism of carbonic anhydrase inhibition with coumarins and thiocoumarins. J Med Chem53:335-44 (2010) 
 
Carbonic anhydrase 12
Name:Carbonic anhydrase 12
Type:Enzyme
Mol. Mass.:39456.00
Organism:Homo sapiens (Human)
Description:Catalytic domain of human cloned isozyme was used in the assay
Residue:354
BDBM50131066
NameBDBM50131066
Synonyms:2-Oxo-2H-chromene-3-carboxylic acid | CHEMBL83294
TypeSmall organic molecule
Emp. Form.C10H6O4
Mol. Mass.190.1522
SMILESOC(=O)c1cc2ccccc2oc1=O