Reaction Details
TargetCarbonic anhydrase 12
LigandBDBM50303491
Substrate/Competitorn/a
Meas. Tech.ChEMBL_595958 (CHEMBL1044460)
Ki 5600±n/a nM
Citation Maresca, ATemperini, CPochet, LMasereel, BScozzafava, ASupuran, CT Deciphering the mechanism of carbonic anhydrase inhibition with coumarins and thiocoumarins. J Med Chem53:335-44 (2010) 
 
Carbonic anhydrase 12
Name:Carbonic anhydrase 12
Type:Enzyme
Mol. Mass.:39456.00
Organism:Homo sapiens (Human)
Description:Catalytic domain of human cloned isozyme was used in the assay
Residue:354
BDBM50303491
NameBDBM50303491
Synonyms:8-methoxy-2-oxo-2H-chromene-3-carboxylic acid | CHEMBL568348
TypeSmall organic molecule
Emp. Form.C11H8O5
Mol. Mass.220.1782
SMILESCOc1cccc2cc(C(O)=O)c(=O)oc12