Reaction Details
TargetCarbonic anhydrase 13
LigandBDBM50303492
Substrate/Competitorn/a
Meas. Tech.ChEMBL_595959 (CHEMBL1044461)
Ki 5600±n/a nM
Citation Maresca, ATemperini, CPochet, LMasereel, BScozzafava, ASupuran, CT Deciphering the mechanism of carbonic anhydrase inhibition with coumarins and thiocoumarins. J Med Chem53:335-44 (2010) 
 
Carbonic anhydrase 13
Name:Carbonic anhydrase 13
Type:Enzyme
Mol. Mass.:29522.80
Organism:Mus musculus (mouse)
Description:Murine cloned isozyme
Residue:262
BDBM50303492
NameBDBM50303492
Synonyms:2-oxo-2H-thiochromene-3-carboxylic acid | CHEMBL571519
TypeSmall organic molecule
Emp. Form.C10H6O3S
Mol. Mass.206.218
SMILESOC(=O)c1cc2ccccc2sc1=O