Reaction Details
TargetCarbonic anhydrase 14
LigandBDBM50303487
Substrate/Competitorn/a
Meas. Tech.ChEMBL_595960 (CHEMBL1044462)
Ki 8400±n/a nM
Citation Maresca, ATemperini, CPochet, LMasereel, BScozzafava, ASupuran, CT Deciphering the mechanism of carbonic anhydrase inhibition with coumarins and thiocoumarins. J Med Chem53:335-44 (2010) 
 
Carbonic anhydrase 14
Name:Carbonic anhydrase 14
Type:Enzyme
Mol. Mass.:37665.67
Organism:Homo sapiens (Human)
Description:Human (cloned) isozyme.
Residue:337
BDBM50303487
NameBDBM50303487
Synonyms:7-phenethoxy-2H-chromen-2-one | CHEMBL567544
TypeSmall organic molecule
Emp. Form.C17H14O2
Mol. Mass.250.2919
SMILESO=c1ccc2ccc(CCc3ccccc3)cc2o1