Reaction Details
TargetCarbonic anhydrase 14
LigandBDBM50303488
Substrate/Competitorn/a
Meas. Tech.ChEMBL_595960 (CHEMBL1044462)
Ki 8600±n/a nM
Citation Maresca, ATemperini, CPochet, LMasereel, BScozzafava, ASupuran, CT Deciphering the mechanism of carbonic anhydrase inhibition with coumarins and thiocoumarins. J Med Chem53:335-44 (2010) 
 
Carbonic anhydrase 14
Name:Carbonic anhydrase 14
Type:Enzyme
Mol. Mass.:37665.67
Organism:Homo sapiens (Human)
Description:Human (cloned) isozyme.
Residue:337
BDBM50303488
NameBDBM50303488
Synonyms:6-methyl-2-oxo-2H-chromene-3-carboxylic acid | CHEMBL577123
TypeSmall organic molecule
Emp. Form.C11H8O4
Mol. Mass.204.1788
SMILESCc1ccc2oc(=O)c(cc2c1)C(O)=O