Reaction Details
TargetCarbonic anhydrase 12
LigandBDBM50303502
Substrate/Competitorn/a
Meas. Tech.ChEMBL_595958 (CHEMBL1044460)
Ki 8600±n/a nM
Citation Maresca, ATemperini, CPochet, LMasereel, BScozzafava, ASupuran, CT Deciphering the mechanism of carbonic anhydrase inhibition with coumarins and thiocoumarins. J Med Chem53:335-44 (2010) 
 
Carbonic anhydrase 12
Name:Carbonic anhydrase 12
Type:Enzyme
Mol. Mass.:39456.00
Organism:Homo sapiens (Human)
Description:Catalytic domain of human cloned isozyme was used in the assay
Residue:354
BDBM50303502
NameBDBM50303502
Synonyms:7-butoxy-2H-chromen-2-one | CHEMBL571514
TypeSmall organic molecule
Emp. Form.C13H14O3
Mol. Mass.218.2485
SMILESCCCCOc1ccc2ccc(=O)oc2c1