Reaction Details
TargetCarbonic anhydrase 4
LigandBDBM50303501
Substrate/Competitorn/a
Meas. Tech.ChEMBL_595952 (CHEMBL1044454)
Ki>500000±n/a nM
Citation Maresca, ATemperini, CPochet, LMasereel, BScozzafava, ASupuran, CT Deciphering the mechanism of carbonic anhydrase inhibition with coumarins and thiocoumarins. J Med Chem53:335-44 (2010) 
 
Carbonic anhydrase 4
Name:Carbonic anhydrase 4
Type:Enzyme
Mol. Mass.:35037.98
Organism:Homo sapiens (Human)
Description:P22748
Residue:312
BDBM50303501
NameBDBM50303501
Synonyms:7-propoxy-2H-chromen-2-one | CHEMBL568516
TypeSmall organic molecule
Emp. Form.C12H12O3
Mol. Mass.204.2219
SMILESCCCOc1ccc2ccc(=O)oc2c1