Reaction Details
TargetCarbonic anhydrase 2
LigandBDBM50303489
Substrate/Competitorn/a
Meas. Tech.ChEMBL_595950 (CHEMBL1041799)
Ki 13400±n/a nM
Citation Maresca, ATemperini, CPochet, LMasereel, BScozzafava, ASupuran, CT Deciphering the mechanism of carbonic anhydrase inhibition with coumarins and thiocoumarins. J Med Chem53:335-44 (2010) 
 
Carbonic anhydrase 2
Name:Carbonic anhydrase 2
Type:Enzyme
Mol. Mass.:29250.71
Organism:Homo sapiens (Human)
Description:P00918
Residue:260
BDBM50303489
NameBDBM50303489
Synonyms:6-methoxy-2-oxo-2H-chromene-3-carboxylic acid | CHEMBL568416
TypeSmall organic molecule
Emp. Form.C11H8O5
Mol. Mass.220.1782
SMILESCOc1ccc2oc(=O)c(cc2c1)C(O)=O