Reaction Details
TargetCarbonic anhydrase 1
LigandBDBM50303495
Substrate/Competitorn/a
Meas. Tech.ChEMBL_595949 (CHEMBL1041798)
Ki 224000±n/a nM
Citation Maresca, ATemperini, CPochet, LMasereel, BScozzafava, ASupuran, CT Deciphering the mechanism of carbonic anhydrase inhibition with coumarins and thiocoumarins. J Med Chem53:335-44 (2010) 
 
Carbonic anhydrase 1
Name:Carbonic anhydrase 1
Type:Enzyme
Mol. Mass.:28873.37
Organism:Homo sapiens (Human)
Description:P00915
Residue:261
BDBM50303495
NameBDBM50303495
Synonyms:CHEMBL568385 | ethyl 7-methoxy-2-oxo-2H-chromene-3-carboxylate
TypeSmall organic molecule
Emp. Form.C13H12O5
Mol. Mass.248.2314
SMILESCCOC(=O)c1cc2ccc(OC)cc2oc1=O