Reaction Details
TargetCarbonic anhydrase 1
LigandBDBM50303502
Substrate/Competitorn/a
Meas. Tech.ChEMBL_595949 (CHEMBL1041798)
Ki 37000±n/a nM
Citation Maresca, ATemperini, CPochet, LMasereel, BScozzafava, ASupuran, CT Deciphering the mechanism of carbonic anhydrase inhibition with coumarins and thiocoumarins. J Med Chem53:335-44 (2010) 
 
Carbonic anhydrase 1
Name:Carbonic anhydrase 1
Type:Enzyme
Mol. Mass.:28873.37
Organism:Homo sapiens (Human)
Description:P00915
Residue:261
BDBM50303502
NameBDBM50303502
Synonyms:7-butoxy-2H-chromen-2-one | CHEMBL571514
TypeSmall organic molecule
Emp. Form.C13H14O3
Mol. Mass.218.2485
SMILESCCCCOc1ccc2ccc(=O)oc2c1