Reaction Details
TargetCarbonic anhydrase 9
LigandBDBM50303501
Substrate/Competitorn/a
Meas. Tech.ChEMBL_595957 (CHEMBL1044459)
Ki 8100±n/a nM
Citation Maresca, ATemperini, CPochet, LMasereel, BScozzafava, ASupuran, CT Deciphering the mechanism of carbonic anhydrase inhibition with coumarins and thiocoumarins. J Med Chem53:335-44 (2010) 
 
Carbonic anhydrase 9
Name:Carbonic anhydrase 9
Type:Enzyme
Mol. Mass.:49669.03
Organism:Homo sapiens (Human)
Description:Catalytic domain of human cloned isozyme was used in the assay
Residue:459
BDBM50303501
NameBDBM50303501
Synonyms:7-propoxy-2H-chromen-2-one | CHEMBL568516
TypeSmall organic molecule
Emp. Form.C12H12O3
Mol. Mass.204.2219
SMILESCCCOc1ccc2ccc(=O)oc2c1