Reaction Details
TargetCarbonic anhydrase 7
LigandBDBM50131066
Substrate/Competitorn/a
Meas. Tech.ChEMBL_595956 (CHEMBL1044458)
Ki 6200±n/a nM
Citation Maresca, ATemperini, CPochet, LMasereel, BScozzafava, ASupuran, CT Deciphering the mechanism of carbonic anhydrase inhibition with coumarins and thiocoumarins. J Med Chem53:335-44 (2010) 
 
Carbonic anhydrase 7
Name:Carbonic anhydrase 7
Type:Enzyme
Mol. Mass.:29664.11
Organism:Homo sapiens (Human)
Description:Human cloned isozyme.
Residue:264
BDBM50131066
NameBDBM50131066
Synonyms:2-Oxo-2H-chromene-3-carboxylic acid | CHEMBL83294
TypeSmall organic molecule
Emp. Form.C10H6O4
Mol. Mass.190.1522
SMILESOC(=O)c1cc2ccccc2oc1=O