Reaction Details
TargetCarbonic anhydrase 6
LigandBDBM50378564
Substrate/Competitorn/a
Meas. Tech.ChEMBL_595955 (CHEMBL1044457)
Ki 93100±n/a nM
Citation Maresca, ATemperini, CPochet, LMasereel, BScozzafava, ASupuran, CT Deciphering the mechanism of carbonic anhydrase inhibition with coumarins and thiocoumarins. J Med Chem53:335-44 (2010) 
 
Carbonic anhydrase 6
Name:Carbonic anhydrase 6
Type:Enzyme
Mol. Mass.:35371.40
Organism:Homo sapiens (Human)
Description:P23280
Residue:308
BDBM50378564
NameBDBM50378564
Synonyms:CHEMBL145781
TypeSmall organic molecule
Emp. Form.C16H12O3
Mol. Mass.252.2647
SMILESO=c1ccc2ccc(OCc3ccccc3)cc2o1