Reaction Details
TargetCarbonic anhydrase 5B, mitochondrial
LigandBDBM50303488
Substrate/Competitorn/a
Meas. Tech.ChEMBL_595954 (CHEMBL1044456)
Ki 8200±n/a nM
Citation Maresca, ATemperini, CPochet, LMasereel, BScozzafava, ASupuran, CT Deciphering the mechanism of carbonic anhydrase inhibition with coumarins and thiocoumarins. J Med Chem53:335-44 (2010) 
 
Carbonic anhydrase 5B, mitochondrial
Name:Carbonic anhydrase 5B, mitochondrial
Type:Enzyme
Mol. Mass.:36440.83
Organism:Homo sapiens (Human)
Description:Human (cloned) isozyme
Residue:317
BDBM50303488
NameBDBM50303488
Synonyms:6-methyl-2-oxo-2H-chromene-3-carboxylic acid | CHEMBL577123
TypeSmall organic molecule
Emp. Form.C11H8O4
Mol. Mass.204.1788
SMILESCc1ccc2oc(=O)c(cc2c1)C(O)=O