Reaction Details
TargetCarbonic anhydrase 5B, mitochondrial
LigandBDBM50378564
Substrate/Competitorn/a
Meas. Tech.ChEMBL_595954 (CHEMBL1044456)
Ki>500000±n/a nM
Citation Maresca, ATemperini, CPochet, LMasereel, BScozzafava, ASupuran, CT Deciphering the mechanism of carbonic anhydrase inhibition with coumarins and thiocoumarins. J Med Chem53:335-44 (2010) 
 
Carbonic anhydrase 5B, mitochondrial
Name:Carbonic anhydrase 5B, mitochondrial
Type:Enzyme
Mol. Mass.:36440.83
Organism:Homo sapiens (Human)
Description:Human (cloned) isozyme
Residue:317
BDBM50378564
NameBDBM50378564
Synonyms:CHEMBL145781
TypeSmall organic molecule
Emp. Form.C16H12O3
Mol. Mass.252.2647
SMILESO=c1ccc2ccc(OCc3ccccc3)cc2o1