Reaction Details
TargetCarbonic anhydrase 5A, mitochondrial
LigandBDBM12342
Substrate/Competitorn/a
Meas. Tech.ChEMBL_595953 (CHEMBL1044455)
Ki 9400±n/a nM
Citation Maresca, ATemperini, CPochet, LMasereel, BScozzafava, ASupuran, CT Deciphering the mechanism of carbonic anhydrase inhibition with coumarins and thiocoumarins. J Med Chem53:335-44 (2010) 
 
Carbonic anhydrase 5A, mitochondrial
Name:Carbonic anhydrase 5A, mitochondrial
Type:Enzyme
Mol. Mass.:34755.54
Organism:Homo sapiens (Human)
Description:Human (cloned) isozyme
Residue:305
BDBM12342
NameBDBM12342
Synonyms:2H-chromen-2-one Coumarin
TypeNatural product
Emp. Form.C9H6O2
Mol. Mass.146.1427
SMILESO=c1ccc2ccccc2o1