Reaction Details
TargetBeta-lactoglobulin
LigandBDBM50378566
Substrate/Competitorn/a
Meas. Tech.ChEMBL_596563 (CHEMBL1042582)
Kd 153±n/a nM
Citation Riihimäki-Lampén, LHVainio, MJVahermo, MPohjala, LLHeikura, JMValkonen, KHVirtanen, VTYli-Kauhaluoma, JTVuorela, PM The binding of synthetic retinoids to lipocalin beta-lactoglobulins. J Med Chem53:514-8 (2010) 
 
Beta-lactoglobulin
Name:Beta-lactoglobulin
Type:PROTEIN
Mol. Mass.:19877.00
Organism:Bos taurus
Description:ChEMBL_596563
Residue:178
BDBM50378566
NameBDBM50378566
Synonyms:CHEMBL571411
TypeSmall organic molecule
Emp. Form.C20H24O2
Mol. Mass.296.4034
SMILESCC1=C(\C=C\c2ccc(\C=C\C(O)=O)cc2)C(C)(C)CCC1