Reaction Details
TargetNociceptin receptor
LigandBDBM50333104
Substrate/Competitorn/a
Meas. Tech.ChEMBL_604478 (CHEMBL1072723)
IC50 0.72±n/a nM
Citation Isozaki, KLi, JOkada, KNishimura, HMatsushima, ANose, TCosta, TShimohigashi, Y Spare interactions of highly potent [Arg(14),Lys(15)]nociceptin for cooperative induction of ORL1 receptor activation. Bioorg Med Chem17:7904-8 (2009) 
 
Nociceptin receptor
Name:Nociceptin receptor
Type:G Protein-Coupled Receptor (GPCR)
Mol. Mass.:40702.87
Organism:Homo sapiens (Human)
Description:P41146
Residue:370
BDBM50333104
NameBDBM50333104
Synonyms:CHEMBL389521 N/OFQ-NH2 Nociceptin-NH2 | Nociceptin/orphanin FQ
TypeSmall organic molecule
Emp. Form.C79H130N28O21
Mol. Mass.1808.0525
SMILES[#6]-[#6](-[#6])-[#6]-[#6@H](-[#7]-[#6](=O)-[#6@H](-[#6]-[#6]-[#6]-[#6]-[#7])-[#7]-[#6](=O)-[#6@H](-[#6]-[#6]-[#6]\[#7]=[#6](/[#7])-[#7])-[#7]-[#6](=O)-[#6@H](-[#6])-[#7]-[#6](=O)-[#6@H](-[#6]-[#8])-[#7]-[#6](=O)-[#6@H](-[#6]-[#6]-[#6]-[#6]-[#7])-[#7]-[#6](=O)-[#6@H](-[#6]-[#6]-[#6]\[#7]=[#6](/[#7])-[#7])-[#7]-[#6](=O)-[#6@H](-[#6])-[#7]-[#6](=O)-[#6]-[#7]-[#6](=O)-[#6@@H](-[#7]-[#6](=O)-[#6@H](-[#6]-c1ccccc1)-[#7]-[#6](=O)-[#6]-[#7]-[#6](=O)-[#6]-[#7]-[#6](=O)-[#6@@H](-[#7])-[#6]-c1ccccc1)-[#6@@H](-[#6])-[#8])-[#6](=O)-[#7]-[#6@@H](-[#6])-[#6](=O)-[#7]-[#6@@H](-[#6]-[#6](-[#7])=O)-[#6](=O)-[#7]-[#6@@H](-[#6]-[#6]-[#6](-[#7])=O)-[#6](-[#7])=O