Reaction Details
TargetTransient receptor potential cation channel subfamily V member 1
LigandBDBM50366620
Substrate/Competitorn/a
Meas. Tech.ChEMBL_603505 (CHEMBL1068424)
EC50 0.019±n/a nM
Citation Appendino, GEch-Chahad, AMinassi, ADe Petrocellis, LDi Marzo, V Structure-activity relationships of the ultrapotent vanilloid resiniferatoxin (RTX): The side chain benzylic methylene. Bioorg Med Chem Lett20:97-9 (2010) 
 
Transient receptor potential cation channel subfamily V member 1
Name:Transient receptor potential cation channel subfamily V member 1
Type:Protein
Mol. Mass.:94960.75
Organism:Homo sapiens (Human)
Description:Q8NER1
Residue:839
BDBM50366620
NameBDBM50366620
Synonyms:RESINIFERATOXIN
TypeSmall organic molecule
Emp. Form.C37H40O9
Mol. Mass.628.7081
SMILESCOc1cc(CC(=O)OCC2=C[C@H]3[C@H]4OC5(Cc6ccccc6)O[C@@]4(C[C@@H](C)[C@]3(O5)[C@@H]3C=C(C)C(=O)[C@@]3(O)C2)C(C)=C)ccc1O