Reaction Details
TargetNeuronal acetylcholine receptor subunit alpha-7
LigandBDBM50305362
Substrate/Competitorn/a
Meas. Tech.ChEMBL_603582 (CHEMBL1071134)
Ki 3.6±n/a nM
Citation Mortell, KHSchrimpf, MRBunnelle, WHAnderson, DJGronlien, JHHagene, KTGopalakrishnan, M Structure-activity relationships of N-substituted ligands for the alpha7 nicotinic acetylcholine receptor. Bioorg Med Chem Lett20:104-7 (2010) 
 
Neuronal acetylcholine receptor subunit alpha-7
Name:Neuronal acetylcholine receptor subunit alpha-7
Type:Enzyme
Mol. Mass.:56502.44
Organism:Rattus norvegicus (Rat)
Description:Q05941
Residue:502
BDBM50305362
NameBDBM50305362
Synonyms:(3aR,6aS)-2-(6-phenylpyridazin-3-yl)-5-(pyridin-3-ylmethyl)octahydropyrrolo[3,4-c]pyrrole | CHEMBL604987
TypeSmall organic molecule
Emp. Form.C22H23N5
Mol. Mass.357.4515
SMILESC(N1C[C@H]2CN(C[C@H]2C1)c1ccc(nn1)-c1ccccc1)c1cccnc1