Reaction Details
TargetNeuronal acetylcholine receptor subunit alpha-7
LigandBDBM50305363
Substrate/Competitorn/a
Meas. Tech.ChEMBL_603582 (CHEMBL1071134)
Ki>10±n/a nM
Citation Mortell, KHSchrimpf, MRBunnelle, WHAnderson, DJGronlien, JHHagene, KTGopalakrishnan, M Structure-activity relationships of N-substituted ligands for the alpha7 nicotinic acetylcholine receptor. Bioorg Med Chem Lett20:104-7 (2010) 
 
Neuronal acetylcholine receptor subunit alpha-7
Name:Neuronal acetylcholine receptor subunit alpha-7
Type:Enzyme
Mol. Mass.:56502.44
Organism:Rattus norvegicus (Rat)
Description:Q05941
Residue:502
BDBM50305363
NameBDBM50305363
Synonyms:CHEMBL601061 | N-methyl-1-(6-phenylpyridazin-3-yl)-N-(pyridin-3-ylmethyl)pyrrolidin-3-amine
TypeSmall organic molecule
Emp. Form.C21H23N5
Mol. Mass.345.4408
SMILESCN(Cc1cccnc1)C1CCN(C1)c1ccc(nn1)-c1ccccc1