Reaction Details
TargetProton-coupled folate transporter
LigandBDBM50306577
Substrate/Competitorn/a
Meas. Tech.ChEMBL_610923 (CHEMBL1067646)
pH6.8±n/a
Ki 2230±n/a nM
Commentsextracted
Citation Wang, LCherian, CDesmoulin, SKPolin, LDeng, YWu, JHou, ZWhite, KKushner, JMatherly, LHGangjee, A Synthesis and antitumor activity of a novel series of 6-substituted pyrrolo[2,3-d]pyrimidine thienoyl antifolate inhibitors of purine biosynthesis with selectivity for high affinity folate receptors and the proton-coupled folate transporter over the reduced folate carrier for cellular entry. J Med Chem53:1306-18 (2010) 
 
Proton-coupled folate transporter
Name:Proton-coupled folate transporter
Type:PROTEIN
Mol. Mass.:49782.13
Organism:Homo sapiens (Human)
Description:ChEMBL_1469597
Residue:459
BDBM50306577
NameBDBM50306577
Synonyms:(S)-2-({5-[5-(2-Amino-4-oxo-4,7-dihydro-3H-pyrrolo[2,3-d]-pyrimidin-6-yl)-pentyl]-thiophene-2-carbonyl}-amino)-pentanedioicAcid | CHEMBL605580
TypeSmall organic molecule
Emp. Form.C21H25N5O6S
Mol. Mass.475.518
SMILESNc1nc2[nH]c(CCCCCc3ccc(s3)C(=O)N[C@@H](CCC(O)=O)C(O)=O)cc2c(=O)[nH]1