Reaction Details
TargetGalanin receptor type 1
LigandBDBM50415433
Substrate/Competitorn/a
Meas. Tech.ChEMBL_610349 (CHEMBL1072081)
Ki 34200±n/a nM
Citation Robertson, CRScholl, EAPruess, THGreen, BRWhite, HSBulaj, G Engineering galanin analogues that discriminate between GalR1 and GalR2 receptor subtypes and exhibit anticonvulsant activity following systemic delivery. J Med Chem53:1871-5 (2010) 
 
Galanin receptor type 1
Name:Galanin receptor type 1
Type:Enzyme Catalytic Domain
Mol. Mass.:38976.60
Organism:Homo sapiens (Human)
Description:Galanin R1 GALR1 HUMAN::P47211
Residue:349
BDBM50415433
NameBDBM50415433
Synonyms:CHEMBL1187471
TypeSmall organic molecule
Emp. Form.C51H60N10O11
Mol. Mass.989.0825
SMILESCOC(=O)[C@H](CCCCN)NC(=O)[C@]1(C)NC(=O)c2nc(oc2C)[C@@](C)(NC(=O)c2nc(oc2C)[C@@](C)(NC(=O)c2nc1oc2C)C(=O)NCC1CCCCC1)C(=O)NC1c2ccccc2-c2ccccc12