Reaction Details
Target5-hydroxytryptamine receptor 3A
LigandBDBM50307817
Substrate/Competitorn/a
Meas. Tech.ChEMBL_612614 (CHEMBL1065651)
Ki 375±n/a nM
Citation Vernekar, SKHallaq, HYClarkson, GThompson, AJSilvestri, LLummis, SCLochner, M Toward biophysical probes for the 5-HT3 receptor: structure-activity relationship study of granisetron derivatives. J Med Chem53:2324-8 (2010) 
 
5-hydroxytryptamine receptor 3A
Name:5-hydroxytryptamine receptor 3A
Type:Protein
Mol. Mass.:55283.27
Organism:Homo sapiens (Human)
Description:P46098
Residue:478
BDBM50307817
NameBDBM50307817
Synonyms:1-Methyl-N-[(3-endo)-9-methyl-9-azabicyclo[3.3.1]non-3-yl]-4-(phenylmethoxy)-1Hindazole-3-carboxamide | CHEMBL598803
TypeSmall organic molecule
Emp. Form.C25H30N4O2
Mol. Mass.418.5313
SMILESCN1[C@H]2CCC[C@H]1CC(C2)NC(=O)c1nn(C)c2cccc(OCc3ccccc3)c12