Reaction Details
Target5-hydroxytryptamine receptor 3A
LigandBDBM50307825
Substrate/Competitorn/a
Meas. Tech.ChEMBL_612614 (CHEMBL1065651)
Ki 71.1±n/a nM
Citation Vernekar, SKHallaq, HYClarkson, GThompson, AJSilvestri, LLummis, SCLochner, M Toward biophysical probes for the 5-HT3 receptor: structure-activity relationship study of granisetron derivatives. J Med Chem53:2324-8 (2010) 
 
5-hydroxytryptamine receptor 3A
Name:5-hydroxytryptamine receptor 3A
Type:Protein
Mol. Mass.:55283.27
Organism:Homo sapiens (Human)
Description:P46098
Residue:478
BDBM50307825
NameBDBM50307825
Synonyms:7-Methoxy-1-methyl-N-[(3-endo)-9-methyl-9-azabicyclo[3.3.1]non-3-yl]-1H-indazole-3-carboxamide | CHEMBL599012
TypeSmall organic molecule
Emp. Form.C19H26N4O2
Mol. Mass.342.4353
SMILESCOc1cccc2c(nn(C)c12)C(=O)NC1C[C@@H]2CCC[C@@H](C1)N2C