Reaction Details
Target5-hydroxytryptamine receptor 1A
LigandBDBM50184800
Substrate/Competitorn/a
Meas. Tech.ChEMBL_608746 (CHEMBL1067759)
Ki 50±n/a nM
Citation Neves, GMenegatti, RAntonio, CBGrazziottin, LRVieira, RORates, SMNoël, FBarreiro, EJFraga, CA Searching for multi-target antipsychotics: Discovery of orally active heterocyclic N-phenylpiperazine ligands of D2-like and 5-HT1A receptors. Bioorg Med Chem18:1925-35 (2010) 
 
5-hydroxytryptamine receptor 1A
Name:5-hydroxytryptamine receptor 1A
Type:G Protein-Coupled Receptor (GPCR)
Mol. Mass.:46445.29
Organism:Rattus norvegicus (rat)
Description:Binding assays were performed using rat hippocampal membranes.
Residue:422
BDBM50184800
NameBDBM50184800
Synonyms:1-Phenyl-4-[(1-phenyl-1H-pyrazol-4-yl)methyl]piperazine CHEMBL210405
TypeSmall organic molecule
Emp. Form.C20H22N4
Mol. Mass.318.4155
SMILESC(N1CCN(CC1)c1ccccc1)c1cnn(c1)-c1ccccc1