Reaction Details
Target5-hydroxytryptamine receptor 1A
LigandBDBM50308004
Substrate/Competitorn/a
Meas. Tech.ChEMBL_608746 (CHEMBL1067759)
Ki 60±n/a nM
Citation Neves, GMenegatti, RAntonio, CBGrazziottin, LRVieira, RORates, SMNoël, FBarreiro, EJFraga, CA Searching for multi-target antipsychotics: Discovery of orally active heterocyclic N-phenylpiperazine ligands of D2-like and 5-HT1A receptors. Bioorg Med Chem18:1925-35 (2010) 
 
5-hydroxytryptamine receptor 1A
Name:5-hydroxytryptamine receptor 1A
Type:G Protein-Coupled Receptor (GPCR)
Mol. Mass.:46445.29
Organism:Rattus norvegicus (rat)
Description:Binding assays were performed using rat hippocampal membranes.
Residue:422
BDBM50308004
NameBDBM50308004
Synonyms:1-[(1-(4-Fluorophenyl)-1H-pyrazol-4-yl)methyl]-4-phenylpiperazine | CHEMBL599658
TypeSmall organic molecule
Emp. Form.C20H21FN4
Mol. Mass.336.4059
SMILESFc1ccc(cc1)-n1cc(CN2CCN(CC2)c2ccccc2)cn1