Reaction Details
TargetMacrophage colony-stimulating factor 1 receptor
LigandBDBM13216
Substrate/Competitorn/a
Meas. Tech.ChEMBL_609722 (CHEMBL1067459)
IC50 7.4±n/a nM
Citation Mashkani, BGriffith, RAshman, LK Colony stimulating factor-1 receptor as a target for small molecule inhibitors. Bioorg Med Chem18:1789-97 (2010) 
 
Macrophage colony-stimulating factor 1 receptor
Name:Macrophage colony-stimulating factor 1 receptor
Type:Protein
Mol. Mass.:107979.48
Organism:Homo sapiens (Human)
Description:P07333
Residue:972
BDBM13216
NameBDBM13216
Synonyms:BMS-354825 DASATINIB N-(2-chloro-6-methylphenyl)-2-({6-[4-(2-hydroxyethyl)piperazin-1-yl]-2-methylpyrimidin-4-yl}amino)-1,3-thiazole-5-carboxamide US20230348453, Compound A8 med.21724, Compound Dasatinib
TypeSmall organic molecule
Emp. Form.C22H26ClN7O2S
Mol. Mass.488.006
SMILESCc1nc(Nc2ncc(s2)C(=O)Nc2c(C)cccc2Cl)cc(n1)N1CCN(CCO)CC1