Reaction Details
TargetVascular endothelial growth factor receptor 2
LigandBDBM50308195
Substrate/Competitorn/a
Meas. Tech.ChEMBL_613676 (CHEMBL1067596)
IC50 18±n/a nM
Citation Egert-Schmidt, AMDreher, JDunkel, UKohfeld, SPreu, LWeber, HEhlert, JEMutschler, BTotzke, FSchächtele, CKubbutat, MHBaumann, KKunick, C Identification of 2-anilino-9-methoxy-5,7-dihydro-6H-pyrimido[5,4-d][1]benzazepin-6-ones as dual PLK1/VEGF-R2 kinase inhibitor chemotypes by structure-based lead generation. J Med Chem53:2433-42 (2010) 
 
Vascular endothelial growth factor receptor 2
Name:Vascular endothelial growth factor receptor 2
Type:Receptor Tyrosine Kinase
Mol. Mass.:151510.97
Organism:Homo sapiens (Human)
Description:P35968
Residue:1356
BDBM50308195
NameBDBM50308195
Synonyms:2-(3-Hydroxy-4-methoxyanilino)-9-methoxy-5,7-dihydro-6H-pyrimido[5,4-d][1]benzazepin-6-one | CHEMBL597393
TypeSmall organic molecule
Emp. Form.C20H18N4O4
Mol. Mass.378.3813
SMILESCOc1ccc-2c(NC(=O)Cc3cnc(Nc4ccc(OC)c(O)c4)nc-23)c1