Reaction Details
TargetCarbonic anhydrase 7
LigandBDBM50187132
Substrate/Competitorn/a
Meas. Tech.ChEMBL_613335 (CHEMBL1074272)
Ki 7810±n/a nM
Citation Innocenti, ABeyza Oztürk Sarikaya, SGülçin, ISupuran, CT Carbonic anhydrase inhibitors. Inhibition of mammalian isoforms I-XIV with a series of natural product polyphenols and phenolic acids. Bioorg Med Chem18:2159-64 (2010) 
 
Carbonic anhydrase 7
Name:Carbonic anhydrase 7
Type:Enzyme
Mol. Mass.:29664.11
Organism:Homo sapiens (Human)
Description:Human cloned isozyme.
Residue:264
BDBM50187132
NameBDBM50187132
Synonyms:3,5-Dimethoxy-4-hydroxybenzoic acid CHEMBL1414 | Syringic acid
TypeSmall organic molecule
Emp. Form.C9H10O5
Mol. Mass.198.1727
SMILESCOc1cc(cc(OC)c1O)C(O)=O