Reaction Details
TargetCarbonic anhydrase 5A, mitochondrial
LigandBDBM50187132
Substrate/Competitorn/a
Meas. Tech.ChEMBL_613332 (CHEMBL1074269)
Ki 6340±n/a nM
Citation Innocenti, ABeyza Oztürk Sarikaya, SGülçin, ISupuran, CT Carbonic anhydrase inhibitors. Inhibition of mammalian isoforms I-XIV with a series of natural product polyphenols and phenolic acids. Bioorg Med Chem18:2159-64 (2010) 
 
Carbonic anhydrase 5A, mitochondrial
Name:Carbonic anhydrase 5A, mitochondrial
Type:Enzyme
Mol. Mass.:34755.54
Organism:Homo sapiens (Human)
Description:Human (cloned) isozyme
Residue:305
BDBM50187132
NameBDBM50187132
Synonyms:3,5-Dimethoxy-4-hydroxybenzoic acid CHEMBL1414 | Syringic acid
TypeSmall organic molecule
Emp. Form.C9H10O5
Mol. Mass.198.1727
SMILESCOc1cc(cc(OC)c1O)C(O)=O