Reaction Details
TargetCarbonic anhydrase 3
LigandBDBM50085536
Substrate/Competitorn/a
Meas. Tech.ChEMBL_613330 (CHEMBL1074267)
Ki 7490±n/a nM
Citation Innocenti, ABeyza Oztürk Sarikaya, SGülçin, ISupuran, CT Carbonic anhydrase inhibitors. Inhibition of mammalian isoforms I-XIV with a series of natural product polyphenols and phenolic acids. Bioorg Med Chem18:2159-64 (2010) 
 
Carbonic anhydrase 3
Name:Carbonic anhydrase 3
Type:Enzyme
Mol. Mass.:29562.11
Organism:Homo sapiens (Human)
Description:Human cloned isozyme.
Residue:260
BDBM50085536
NameBDBM50085536
Synonyms:3,4,5-Trihydroxybenzoate, X CHEMBL288114 gallic acid
TypeSmall organic molecule
Emp. Form.C7H6O5
Mol. Mass.170.1195
SMILESOC(=O)c1cc(O)c(O)c(O)c1