Reaction Details
TargetCarbonic anhydrase 5B, mitochondrial
LigandBDBM26194
Substrate/Competitorn/a
Meas. Tech.ChEMBL_613333 (CHEMBL1074270)
Ki 7130±n/a nM
Citation Innocenti, ABeyza Oztürk Sarikaya, SGülçin, ISupuran, CT Carbonic anhydrase inhibitors. Inhibition of mammalian isoforms I-XIV with a series of natural product polyphenols and phenolic acids. Bioorg Med Chem18:2159-64 (2010) 
 
Carbonic anhydrase 5B, mitochondrial
Name:Carbonic anhydrase 5B, mitochondrial
Type:Enzyme
Mol. Mass.:36440.83
Organism:Homo sapiens (Human)
Description:Human (cloned) isozyme
Residue:317
BDBM26194
NameBDBM26194
Synonyms:4-Hydroxybenzoate, III CHEMBL441343 phenol derivative, 8
TypeSmall organic molecule
Emp. Form.C7H6O3
Mol. Mass.138.1207
SMILESOC(=O)c1ccc(O)cc1